{"text_format":"1","workbook":"xlsx","n_sheets":15,"sheets":["ESAT_Guidelines","ES Definition","Indicator Definition","Reliability Scores","Description of Study Area","ES Relevance","Initial Status","Present Status","Initial and Present Status","ES Assessment","Results ES Classes","Results ES Sections","Results ES Overall","Metrics Initial Status","Metrics Present Status"],"not_rendered":{"charts":9,"images":10,"macros":1,"external_links":0,"defined_names":1,"comments":1,"pivot_tables":0},"unopened":[],"bounds":{"document_bytes":16777216,"sheet_cells":100000,"rows_first":2000,"rows_last":500,"rows_between":2000,"halvings":0,"cell_chars":16384,"cell_head_chars":4096},"cells_cut":0,"cells_raw":0,"read":"whole","date_system":"1900"}

{"sheet":"ESAT_Guidelines","index":0,"n_rows":0,"n_cols":0,"rows_kept":0,"cut":false,"hidden":false,"merged":[]}

{"sheet":"ES Definition","index":1,"n_rows":40,"n_cols":7,"rows_kept":40,"cut":false,"hidden":false,"merged":[[29,1,39,1],[29,2,35,2],[29,3,30,3],[31,3,35,3],[36,2,39,2],[36,3,37,3],[38,3,39,3],[13,1,27,1],[13,2,17,2],[13,3,14,3],[15,3,17,3],[18,2,21,2],[18,3,19,3],[22,2,27,2],[26,3,27,3],[1,2,1,4],[3,1,11,1],[3,2,6,2],[3,3,6,3],[7,2,9,2],[7,3,8,3],[10,2,11,2],[10,3,11,3]]}
[]
[null,null,"Ecosystem Services Classification, based on CICES V4.3"]
[null,"Section","Division","Group","Class","Class type","Examples"]
[null,"Provisioning Services","Nutrition","Biomass","Wild plants, algae and their outputs","Plants, algae by amount, type","Wild berries, fruits, mushrooms, water cress, salicornia (saltwort or samphire); seaweed (e.g. Palmaria palmata = dulse, dillisk) for food"]
[null,null,null,null,"Wild animals and their outputs","Animals by amount, type","Game, freshwater fish (trout, eel etc.), marine fish (plaice, sea bass etc.) and shellfish (i.e. crustaceans, molluscs), as well as equinoderms or honey harvested from wild populations; Includes commercial and subsistence fishing and hunting for food"]
[null,null,null,null,"Animals from in situ aquaculture","Animals by amount, type","In-situ farming of freshwater (e.g. trout) and marine fish (e.g. salmon, tuna) also in floating cages; shellfish aquaculture (e.g. oysters or crustaceans) in e.g. poles "]
{"$rows_left_out":35}
{"sheet":"Indicator Definition","index":2,"n_rows":61,"n_cols":6,"rows_kept":61,"cut":false,"hidden":false,"merged":[[4,3,5,3],[1,1,1,5],[2,1,10,1],[2,2,9,2],[2,3,3,3],[14,1,15,1],[14,2,15,2],[11,1,13,1],[11,2,12,2],[6,3,7,3],[8,3,9,3],[17,1,17,5],[37,2,39,2],[40,2,44,2],[37,3,39,3],[40,3,43,3],[27,1,44,1],[27,2,32,2],[33,2,34,2],[35,2,36,2],[24,2,26,2],[24,3,26,3],[18,1,21,1],[18,2,21,2],[18,3,20,3],[22,1,26,1],[22,2,23,2],[47,2,55,2],[48,3,52,3],[27,3,32,3],[33,3,34,3],[35,3,36,3],[46,1,46,5],[47,1,55,1],[57,5,58,5],[59,2,60,2],[56,1,60,1],[56,2,58,2],[57,3,58,3],[57,4,58,4]]}
[]
[null,"Ecosystem Service Section: Provisioning Services"]
[null,"Division: Nutrition","Group: Biomass","Class: Wild plants, algae and their outputs","Indicator: Harvest – Ton/yr./km2","Biomass of all plants and algae used for human consumption. It can be directly consumed, or indirectly by extraction of elements or parts of the organism that is used for consumption"]
[null,null,null,null,"Indicator: Nº of Species – Nº/km2","Number of all species used by humans for nutritional reasons"]
[null,null,null,"Class: Wild animals and their outputs","Indicator: Landings – Ton/yr./km2","All reported biomass connected with commercial fisheries. It includes the biomass of all species (fish or shellfish) of the fisheries of the assessment area. It can include fisheries from elsewhere outside of the study area but that are unloaded and sold in the fish markets within the assessment area"]
[null,null,null,null,"Indicator: Landing of key market species – Ton/yr./km2","Biomass of key market species only."]
{"$rows_left_out":56}
{"sheet":"Reliability Scores","index":3,"n_rows":7,"n_cols":7,"rows_kept":7,"cut":false,"hidden":false,"merged":[[1,3,1,6]]}
[]
[null,null,null,"Source of Data"]
[null,null,null,"Database / dataset","Reports / Literature","Other Sources","Expert valuation"]
[null,"Very High",1,"Official data which is maintained on a regular basis with sound scientific accuracy (Example: EU Databases, Government or University/Institutes databases)","Published and Peer-Reviewed Scientific Papers in High ranking or high impact factor Journals. Official EU or Government Reports","Official EU, Government or EU funded Project websites or other sources of information.","Person with sound scientific or institutional knowledge about the selected service or indicator with proven knowledge regarding the topic addressed, more than 10 years of experience"]
[null,"High",2,"Database maintained by Research Groups or individual researchers which can be access upon request","Public official reports by Government, Published Papers with a low impact factor and low-ranking Journals","Official websites and accredited material from universities or institutes","Person with sound scientific, common or institutional knowledge about the selected service or indicator with proven knowledge regarding the topic addressed with less than 10 years of experience"]
[null,"Moderate",3,"Public/private dataset that is not verified or validated","Public Reports, Scientific Papers not peer-reviewed","Unverified sources, public media and websites without a scientific background","Person which works in the related field and has knowledge about the service or indicator but for other system other than the assessment area (scientist or not)"]
{"$rows_left_out":2}
{"sheet":"Description of Study Area","index":4,"n_rows":30,"n_cols":13,"rows_kept":30,"cut":false,"hidden":false,"merged":[[2,1,4,18],[31,5,64,18],[7,12,8,18],[9,5,24,11],[9,12,24,18],[7,5,8,11],[29,5,30,18]]}
[]
[]
[null,"Description of Study Area"]
[]
[]
[]
{"$rows_left_out":25}
{"sheet":"ES Relevance","index":5,"n_rows":37,"n_cols":14,"rows_kept":37,"cut":false,"hidden":false,"merged":[[1,7,1,8],[2,7,3,7],[2,8,3,8],[14,7,14,8],[26,7,26,8],[3,10,3,13],[11,10,11,13],[26,5,26,6],[27,1,36,1],[27,2,32,2],[27,3,28,3],[29,3,32,3],[33,2,36,2],[33,3,34,3],[35,3,36,3],[14,5,14,6],[15,1,25,1],[15,2,16,2],[15,3,16,3],[17,2,19,2],[17,3,18,3],[20,2,25,2],[24,3,25,3],[9,2,11,2],[9,3,10,3],[12,2,13,2],[12,3,13,3],[2,5,3,5],[2,6,3,6],[4,1,13,1],[4,2,8,2],[4,3,7,3],[1,1,2,4],[1,5,1,6]]}
[]
[null,"Ecosystem Services Classification",null,null,null,"Initial Status",null,"Present Status"]
[null,null,null,null,null,"Relevant for the Study Area? (Y / N)","Assessed (Y / N)","Relevant for the Study Area? (Y / N)","Assessed (Y / N)"]
[null,"Section","Division","Group","Class",null,null,null,null,null,"Initial Status"]
[null,"Provisioning Services","Nutrition","Biomass","Wild plants, algae and their outputs",null,null,null,null,null,"Total Relevant",null," Total Assessed"]
[null,null,null,null,"Wild animals and their outputs",null,null,null,null,null,"Relevant",{"$f":"COUNTIF(F5:F37,\"Y\")","v":0},"Assessed",{"$f":"COUNTIF(G5:G37,\"Y\")","v":0}]
{"$rows_left_out":32}
{"sheet":"Initial Status","index":6,"n_rows":61,"n_cols":40,"rows_kept":61,"cut":false,"hidden":false,"merged":[[3,30,3,31],[3,32,3,33],[0,0,2,13],[3,16,3,17],[3,18,3,19],[3,20,3,21],[3,22,3,23],[2,32,2,33],[2,24,2,25],[3,28,3,29],[3,38,3,39],[47,30,47,31],[47,32,47,33],[1,15,1,34],[19,28,19,29],[19,30,19,31],[19,32,19,33],[47,16,47,17],[47,18,47,19],[47,20,47,21],[47,22,47,23],[47,24,47,25],[47,26,47,27],[47,28,47,29],[2,28,2,29],[2,30,2,31],[19,26,19,27],[2,22,2,23],[2,16,2,17],[2,18,2,19],[2,20,2,21],[2,26,2,27],[3,24,3,25],[3,26,3,27],[19,16,19,17],[19,18,19,19],[19,20,19,21],[19,22,19,23],[19,24,19,25],[4,12,4,13],[3,8,3,13],[19,12,19,13],[47,12,47,13],[3,0,3,3],[20,0,46,0],[26,3,28,3],[26,2,28,2],[24,1,28,1],[29,2,34,2],[29,3,34,3],[35,2,36,2],[5,0,18,0],[20,1,23,1],[20,2,23,2],[3,5,3,7],[29,1,46,1],[35,3,36,3],[37,2,38,2],[37,3,38,3],[39,2,41,2],[39,3,41,3],[42,2,46,2],[42,3,45,3],[20,3,22,3],[24,2,25,2],[7,3,8,3],[9,3,10,3],[11,3,12,3],[5,3,6,3],[5,1,13,1],[48,0,60,0],[48,1,56,1],[48,2,51,2],[49,3,51,3],[52,2,56,2],[52,3,53,3],[57,1,60,1],[57,2,58,2],[59,2,60,2],[14,1,16,1],[14,2,15,2],[17,1,18,1],[17,2,18,2],[5,2,11,2]]}
["Data Documentation for Initial Status"]
[null,null,null,null,null,null,null,null,null,null,null,null,null,null,null,"Classes of ES"]
[null,null,null,null,null,null,null,null,null,null,null,null,null,null,null,"< 1/4.1","1/2.5 to 1/4.1",null,"1/1.7 to 1/2.5",null,"1/1.3 to 1/1.7",null,"1/1.1 to1/1.3",null,"Initial Status",null,"1.1 to 1.3",null,"1.3 to 1.7",null,"1.7 to 2.5",null,"2.5 to 4.1",null,"> 4.1"]
["Ecosystem Services Classification",null,null,null,null,"Indicators Proposed ",null,null,"Data Sources",null,null,null,null,null,null,-5,-4,null,-3,null,-2,null,-1,null,0,null,1,null,2,null,3,null,4,null,5,null,null,"Type of data","Quality/Reliability"]
["Section","Division","Group","Class",null," Indicator","Units","Value","Type of Data","Source","Author","Year "," Reliability",null,null,"< 1/4.1","1/4.1","1/2.5","1/2.5","1/1.7","1/1.7","1/1.3","1/1.3","1/1.1","1/1.1",1.1000000000000001,1.1000000000000001,1.3,1.3,1.7,1.7,2.5,2.5,4.0999999999999996,4.0999999999999996]
["Provisioning Services","Nutrition","Biomass","Wild plants, algae and their outputs",null,"Harvest","Ton/yr./km2",null,null,null,null,null,null,{"$f":"IF(M6=1,$AN$6,IF(M6=2,$AN$7,IF(M6=3,$AN$8,IF(M6=4,$AN$9))))","v":false},null,{"$f":"H6*1/4.1","v":0},{"$f":"H6*1/4.1","v":0},{"$f":"H6*1/2.5","v":0},{"$f":"H6*1/2.5","v":0},{"$f":"H6*1/1.7","v":0},{"$f":"H6*1/1.7","v":0},{"$f":"H6*1/1.3","v":0},{"$f":"H6*1/1.3","v":0},{"$f":"H6*1/1.1","v":0},{"$f":"H6*1/1.1","v":0},{"$f":"H6*1.1","v":0},{"$f":"H6*1.1","v":0},{"$f":"H6*1.3","v":0},{"$f":"H6*1.3","v":0},{"$f":"H6*1.7","v":0},{"$f":"H6*1.7","v":0},{"$f":"H6*2.5","v":0},{"$f":"H6*2.5","v":0},{"$f":"H6*4.1","v":0},{"$f":"H6*4.1","v":0},null,null,"Database/ dataset",1,"Very High"]
{"$rows_left_out":56}
{"sheet":"Present Status","index":7,"n_rows":61,"n_cols":49,"rows_kept":61,"cut":false,"hidden":false,"merged":[[2,31,2,32],[2,33,2,34],[0,0,2,14],[47,13,47,14],[47,29,47,30],[47,31,47,32],[47,33,47,34],[47,17,47,18],[47,19,47,20],[47,21,47,22],[47,23,47,24],[47,25,47,26],[47,27,47,28],[37,3,38,3],[39,2,41,2],[39,3,41,3],[48,0,60,0],[48,1,56,1],[48,2,51,2],[49,3,51,3],[52,2,56,2],[52,3,53,3],[57,1,60,1],[57,2,58,2],[59,2,60,2],[19,25,19,26],[19,27,19,28],[19,29,19,30],[24,2,25,2],[26,2,28,2],[26,3,28,3],[19,31,19,32],[19,33,19,34],[19,21,19,22],[20,0,46,0],[20,1,23,1],[20,2,23,2],[20,3,22,3],[24,1,28,1],[29,1,46,1],[29,2,34,2],[29,3,34,3],[35,2,36,2],[35,3,36,3],[37,2,38,2],[42,2,46,2],[42,3,45,3],[3,39,3,40],[19,23,19,24],[5,0,18,0],[5,1,13,1],[5,2,11,2],[5,3,6,3],[7,3,8,3],[9,3,10,3],[11,3,12,3],[14,1,16,1],[14,2,15,2],[17,1,18,1],[17,2,18,2],[19,13,19,14],[19,17,19,18],[19,19,19,20],[3,0,3,3],[3,9,3,14],[3,5,3,8],[1,16,1,35],[3,17,3,18],[3,19,3,20],[3,21,3,22],[3,23,3,24],[3,25,3,26],[3,27,3,28],[3,29,3,30],[3,31,3,32],[3,33,3,34],[2,17,2,18],[2,19,2,20],[2,29,2,30],[2,21,2,22],[2,23,2,24],[2,25,2,26],[2,27,2,28],[4,13,4,14]]}
["Data Documentation for Present Status"]
[null,null,null,null,null,null,null,null,null,null,null,null,null,null,null,null,"Classes of ES"]
[null,null,null,null,null,null,null,null,null,null,null,null,null,null,null,null,"< 1/4.1","1/2.5 to 1/4.1",null,"1/1.7 to 1/2.5",null,"1/1.3 to 1/1.7",null,"1/1.1 to1/1.3",null,"Initial Status",null,"1.1 to 1.3",null,"1.3 to 1.7",null,"1.7 to 2.5",null,"2.5 to 4.1",null,"> 4.1",null,null,null,null,null,"Classes"]
["Ecosystem Services Classification",null,null,null,null,"Indicators Proposed ",null,null,null,"Data Sources",null,null,null,null,null,null,-5,-4,null,-3,null,-2,null,-1,null,0,null,1,null,2,null,3,null,4,null,5,null,null,"Type of data","Quality/Reliability"]
["Section","Division","Group","Class",null," Indicator","Units","Value","Class of change","Type of Data","Source","Author","Year ","Reliability",null,null,"< 1/4.1","1/4.1","1/2.5","1/2.5","1/1.7","1/1.7","1/1.3","1/1.3","1/1.1","1/1.1",1.1000000000000001,1.1000000000000001,1.3,1.3,1.7,1.7,2.5,2.5,4.0999999999999996,4.0999999999999996,null,null,null,null,null,"no data"]
["Provisioning Services","Nutrition","Biomass","Wild plants, algae and their outputs",null,"Harvest","Ton/yr./km2",null,null,null,null,null,null,null,{"$f":"IF(N6=1,$AO$6,IF(N6=2,$AO$7,IF(N6=3,$AO$8,IF(N6=4,$AO$9))))","v":false},null,{"$f":"'Initial Status'!P6","v":0},{"$f":"'Initial Status'!Q6","v":0},{"$f":"'Initial Status'!R6","v":0},{"$f":"'Initial Status'!S6","v":0},{"$f":"'Initial Status'!T6","v":0},{"$f":"'Initial Status'!U6","v":0},{"$f":"'Initial Status'!V6","v":0},{"$f":"'Initial Status'!W6","v":0},{"$f":"'Initial Status'!X6","v":0},{"$f":"'Initial Status'!Y6","v":0},{"$f":"'Initial Status'!Z6","v":0},{"$f":"'Initial Status'!AA6","v":0},{"$f":"'Initial Status'!AB6","v":0},{"$f":"'Initial Status'!AC6","v":0},{"$f":"'Initial Status'!AD6","v":0},{"$f":"'Initial Status'!AE6","v":0},{"$f":"'Initial Status'!AF6","v":0},{"$f":"'Initial Status'!AG6","v":0},{"$f":"'Initial Status'!AH6","v":0},{"$f":"'Initial Status'!AI6","v":0},null,null,"Database/ dataset",1,"Very High","-5",252,41,36]
{"$rows_left_out":56}
{"sheet":"Initial and Present Status","index":8,"n_rows":61,"n_cols":13,"rows_kept":61,"cut":false,"hidden":false,"merged":[[5,0,18,0],[5,1,13,1],[5,2,11,2],[14,1,16,1],[24,1,28,1],[24,2,25,2],[26,2,28,2],[20,1,23,1],[20,2,23,2],[14,2,15,2],[17,1,18,1],[17,2,18,2],[20,0,46,0],[29,2,34,2],[42,2,46,2],[37,2,38,2],[35,3,36,3],[48,0,60,0],[48,1,56,1],[48,2,51,2],[49,3,51,3],[52,2,56,2],[52,3,53,3],[57,1,60,1],[57,2,58,2],[59,2,60,2],[2,9,2,12],[2,5,2,7],[42,3,45,3],[29,3,34,3],[20,3,22,3],[2,0,2,3],[5,3,6,3],[7,3,8,3],[9,3,10,3],[11,3,12,3],[37,3,38,3],[39,2,41,2],[39,3,41,3],[29,1,46,1],[26,3,28,3],[35,2,36,2]]}
[]
[]
["Ecosystem Services Classification",null,null,null,null,"\"Initial Status Assessment\"",null,null,null,"\"Present Status Assessment\""]
[]
["Section","Division","Group","Class",null," Indicator","Units","Value",null," Indicator","Units","Value","Class of change"]
["Provisioning Services","Nutrition","Biomass","Wild plants, algae and their outputs",null,"Harvest","Ton/yr./km2",{"$f":"IF(ISBLANK('Initial Status'!H6),\"\",'Initial Status'!H6)","v":""},null,"Harvest","Ton/yr./km2",{"$f":"IF(ISBLANK('Present Status'!H6),\"\",'Present Status'!H6)","v":""},{"$f":"IF(ISBLANK('Present Status'!I6),\"\",'Present Status'!I6)","v":""}]
{"$rows_left_out":56}
{"sheet":"ES Assessment","index":9,"n_rows":56,"n_cols":24,"rows_kept":56,"cut":false,"hidden":false,"merged":[[52,18,53,18],[52,19,53,19],[54,18,55,18],[54,19,55,19],[38,19,42,19],[38,20,41,20],[38,21,41,21],[43,14,55,14],[43,15,55,15],[43,16,51,16],[43,17,51,17],[43,18,46,18],[43,19,46,19],[44,20,46,20],[44,21,46,21],[47,18,51,18],[47,19,51,19],[47,20,48,20],[47,21,48,21],[52,16,55,16],[16,14,42,14],[16,15,42,15],[25,16,42,16],[35,20,37,20],[16,20,18,20],[16,21,18,21],[35,21,37,21],[25,19,30,19],[25,20,30,20],[25,21,30,21],[31,18,32,18],[31,19,32,19],[31,20,32,20],[31,21,32,21],[19,18,21,18],[19,19,21,19],[22,18,24,18],[22,19,24,19],[22,20,24,20],[22,21,24,21],[25,18,30,18],[33,18,34,18],[33,19,34,19],[33,20,34,20],[33,21,34,21],[35,18,37,18],[35,19,37,19],[2,20,3,20],[2,21,3,21],[4,20,5,20],[4,21,5,21],[6,20,7,20],[6,21,7,21],[8,20,9,20],[8,21,9,21],[11,19,12,19],[14,19,15,19],[16,19,18,19],[19,16,24,16],[19,17,24,17],[25,17,42,17],[38,18,42,18],[1,14,1,15],[1,16,1,17],[1,18,1,19],[2,19,9,19],[14,16,15,16],[2,14,15,14],[2,15,15,15],[2,16,10,16],[2,17,10,17],[2,18,9,18],[11,16,13,16],[11,17,13,17],[11,18,12,18],[16,16,18,16],[16,17,18,17],[16,18,18,18],[14,17,15,17],[14,18,15,18],[1,20,1,21],[1,22,1,23],[16,1,42,1],[38,5,42,5],[38,6,42,6],[16,4,18,4],[16,3,18,3],[19,4,24,4],[19,3,24,3],[25,4,42,4],[25,3,42,3],[31,5,32,5],[31,6,32,6],[33,6,34,6],[33,5,34,5],[16,2,42,2],[35,5,37,5],[35,6,37,6],[22,8,24,8],[2,1,15,1],[1,9,1,10],[1,7,1,8],[1,5,1,6],[1,3,1,4],[1,1,1,2],[11,5,12,5],[11,6,12,6],[14,5,15,5],[14,6,15,6],[2,3,10,3],[2,4,10,4],[14,4,15,4],[11,3,13,3],[11,4,13,4],[2,2,15,2],[4,7,5,7],[4,8,5,8],[2,5,9,5],[2,6,9,6],[6,7,7,7],[6,8,7,8],[8,8,9,8],[8,7,9,7],[2,7,3,7],[2,8,3,8],[22,5,24,5],[25,6,30,6],[25,5,30,5],[19,6,21,6],[22,7,24,7],[25,8,30,8],[25,7,30,7],[14,3,15,3],[16,8,18,8],[16,7,18,7],[16,5,18,5],[16,6,18,6],[19,5,21,5],[38,8,41,8],[38,7,41,7],[31,8,32,8],[31,7,32,7],[33,8,34,8],[33,7,34,7],[35,8,37,8],[35,7,37,7],[22,6,24,6],[52,17,55,17],[43,2,55,2],[44,8,46,8],[44,7,46,7],[43,6,46,6],[43,5,46,5],[43,1,55,1],[52,6,53,6],[52,5,53,5],[54,6,55,6],[54,5,55,5],[43,3,51,3],[43,4,51,4],[52,4,55,4],[52,3,55,3],[47,8,48,8],[47,7,48,7],[47,5,51,5],[47,6,51,6]]}
[]
[null,"Section",null,"Division",null,"Group",null,"Class",null,"Indicators",null,null,null,null,"Section",null,"Division",null,"Group",null,"Class",null,"Indicators"]
[null,"Provisioning Services",{"$f":"ROUND(AVERAGE(E3:E16),0)","v":{"$error":"#DIV/0!"}},"Nutrition",{"$f":"ROUND(AVERAGE(G3:G11),0)","v":{"$error":"#DIV/0!"}},"Biomass",{"$f":"ROUND(AVERAGE(I3:I10),0)","v":{"$error":"#DIV/0!"}},"Wild plants, algae and their outputs",{"$f":"AVERAGE(K3:K4)","v":{"$error":"#DIV/0!"}},"Harvest",{"$f":"IF(ISBLANK('Initial and Present Status'!M6),\"\",'Initial and Present Status'!M6)","v":""},null,null,null,"Provisioning Services",{"$f":"IFERROR(ROUND(AVERAGE(R3:R16),0),\"\")","v":""},"Nutrition",{"$f":"IFERROR(ROUND(AVERAGE(T3:T11),0),\"\")","v":""},"Biomass",{"$f":"IFERROR(ROUND(AVERAGE(V3:V10),0),\"\")","v":""},"Wild plants, algae and their outputs",{"$f":"IFERROR(ROUND(AVERAGE(X3:X4),0),\"\")","v":""},"Harvest",{"$f":"IFERROR(VALUE(K3),\"\")","v":""}]
[null,null,null,null,null,null,null,null,null,"Nº of Species ",{"$f":"IF(ISBLANK('Initial and Present Status'!M7),\"\",'Initial and Present Status'!M7)","v":""},null,null,null,null,null,null,null,null,null,null,null,"Nº of Species ",""]
[null,null,null,null,null,null,null,"Wild animals and their outputs",{"$f":"ROUND(AVERAGE(K5:K6),0)","v":{"$error":"#DIV/0!"}},"Landings",{"$f":"IF(ISBLANK('Initial and Present Status'!M8),\"\",'Initial and Present Status'!M8)","v":""},null,null,null,null,null,null,null,null,null,"Wild animals and their outputs",{"$f":"IFERROR(ROUND(AVERAGE(X5:X6),0),\"\")","v":""},"Landings",""]
[null,null,null,null,null,null,null,null,null,"Landing of key market species",{"$f":"IF(ISBLANK('Initial and Present Status'!M9),\"\",'Initial and Present Status'!M9)","v":""},null,null,null,null,null,null,null,null,null,null,null,"Landing of key market species",""]
{"$rows_left_out":51}
{"sheet":"Results ES Classes","index":10,"n_rows":33,"n_cols":6,"rows_kept":33,"cut":false,"hidden":false,"merged":[[13,3,15,3],[13,2,16,2],[10,2,11,2],[7,2,9,2],[2,3,5,3],[2,2,6,2],[23,1,32,1],[2,1,11,1],[12,1,22,1],[10,3,11,3],[25,3,28,3],[23,3,24,3],[23,2,28,2],[29,2,32,2],[29,3,30,3],[31,3,32,3],[21,3,22,3],[17,2,22,2]]}
[]
[null,"Section","Division","Group","Class","Class of Change"]
[null,"Provisioning Services","Nutrition","Biomass","Wild plants, algae and their outputs",{"$f":"'ES Assessment'!V3","v":""}]
[null,null,null,null,"Wild animals and their outputs",{"$f":"'ES Assessment'!V5","v":""}]
[null,null,null,null,"Animals from in situ aquaculture",{"$f":"'ES Assessment'!V7","v":""}]
[null,null,null,null,"Plants and algae from in situ aquaculture",{"$f":"'ES Assessment'!V9","v":""}]
{"$rows_left_out":28}
{"sheet":"Results ES Sections","index":11,"n_rows":56,"n_cols":16,"rows_kept":56,"cut":false,"hidden":false,"merged":[[47,5,51,5],[47,6,51,6],[47,7,48,7],[47,8,48,8],[52,3,55,3],[52,5,53,5],[52,6,53,6],[54,5,55,5],[54,6,55,6],[38,5,42,5],[38,6,42,6],[38,7,41,7],[38,8,41,8],[43,1,55,1],[43,2,55,2],[43,3,51,3],[43,4,51,4],[43,5,46,5],[43,6,46,6],[16,1,42,1],[16,2,42,2],[25,3,42,3],[25,4,42,4],[44,7,46,7],[44,8,46,8],[33,5,34,5],[33,6,34,6],[33,7,34,7],[33,8,34,8],[35,5,37,5],[35,6,37,6],[35,7,37,7],[35,8,37,8],[25,7,30,7],[25,8,30,8],[31,5,32,5],[31,6,32,6],[31,7,32,7],[31,8,32,8],[25,5,30,5],[25,6,30,6],[16,7,18,7],[16,8,18,8],[19,3,24,3],[19,4,24,4],[19,5,21,5],[19,6,21,6],[22,5,24,5],[22,6,24,6],[22,7,24,7],[22,8,24,8],[16,3,18,3],[16,4,18,4],[16,5,18,5],[16,6,18,6],[11,6,12,6],[14,3,15,3],[14,4,15,4],[14,5,15,5],[14,6,15,6],[2,6,9,6],[2,7,3,7],[2,8,3,8],[4,7,5,7],[4,8,5,8],[6,7,7,7],[6,8,7,8],[8,7,9,7],[8,8,9,8],[1,1,1,2],[1,3,1,4],[1,5,1,6],[1,7,1,8],[1,9,1,10],[2,1,15,1],[2,2,15,2],[2,3,10,3],[2,4,10,4],[2,5,9,5],[11,3,13,3],[11,4,13,4],[11,5,12,5]]}
[]
[null,"Section",null,"Division",null,"Group",null,"Class",null,"Indicators"]
[null,"Provisioning Services",{"$f":"IFERROR(ROUND(AVERAGE(E3:E16),0),\"\")","v":""},"Nutrition",{"$f":"IFERROR(ROUND(AVERAGE(G3:G11),0),\"\")","v":""},"Biomass",{"$f":"IFERROR(ROUND(AVERAGE(I3:I10),0),\"\")","v":""},"Wild plants, algae and their outputs",{"$f":"IFERROR(ROUND(AVERAGE(K3:K4),0),\"\")","v":""},"Harvest",{"$f":"'ES Assessment'!X3","v":""},null,null,"Provisioning Services",{"$f":"C3","v":""},0]
[null,null,null,null,null,null,null,null,null,"Nº of Species ",{"$f":"'ES Assessment'!X4","v":""},null,null,"Regulating & Maintenance Services",{"$f":"C17","v":""},0]
[null,null,null,null,null,null,null,"Wild animals and their outputs",{"$f":"IFERROR(ROUND(AVERAGE(K5:K6),0),\"\")","v":""},"Landings",{"$f":"'ES Assessment'!X5","v":""},null,null,"Cultural Services",{"$f":"C44","v":""},0]
[null,null,null,null,null,null,null,null,null,"Landing of key market species",{"$f":"'ES Assessment'!X6","v":""}]
{"$rows_left_out":51}
{"sheet":"Results ES Overall","index":12,"n_rows":55,"n_cols":16,"rows_kept":55,"cut":false,"hidden":false,"merged":[[0,1,0,3],[0,4,0,6],[0,7,0,9],[0,10,0,12],[0,13,0,15]]}
[null,"Sections",null,null,"Divisions",null,null,"Groups",null,null,"Classes",null,null,"Indicators"]
[null,{"$f":"'ES Assessment'!P3","v":""},14,1,{"$f":"'ES Assessment'!R3","v":""},9,1,{"$f":"'ES Assessment'!T3","v":""},8,1,{"$f":"'ES Assessment'!V3","v":""},2,1,{"$f":"'ES Assessment'!X3","v":""},1,1]
[null,{"$f":"'ES Assessment'!P17","v":""},27,2,{"$f":"'ES Assessment'!R12","v":""},3,2,{"$f":"'ES Assessment'!T11","v":""},1,2,{"$f":"'ES Assessment'!V5","v":""},2,2,{"$f":"'ES Assessment'!X4","v":""},1,{"$f":"P2+1","v":2}]
[null,{"$f":"'ES Assessment'!P44","v":""},13,3,{"$f":"'ES Assessment'!R15","v":""},2,3,{"$f":"'ES Assessment'!T12","v":""},2,3,{"$f":"'ES Assessment'!V7","v":""},2,3,{"$f":"'ES Assessment'!X5","v":""},1,{"$f":"P3+1","v":3}]
[null,null,null,null,{"$f":"'ES Assessment'!R17","v":""},3,4,{"$f":"'ES Assessment'!T14","v":""},1,4,{"$f":"'ES Assessment'!V9","v":""},2,4,{"$f":"'ES Assessment'!X6","v":""},1,4]
[null,null,null,null,{"$f":"'ES Assessment'!R20","v":""},6,5,{"$f":"'ES Assessment'!T15","v":""},2,5,{"$f":"'ES Assessment'!V11","v":""},1,5,{"$f":"'ES Assessment'!X7","v":""},1,5]
{"$rows_left_out":50}
{"sheet":"Metrics Initial Status","index":13,"n_rows":11,"n_cols":16,"rows_kept":11,"cut":false,"hidden":false,"merged":[[4,5,4,15],[5,5,6,5],[5,6,5,7],[5,8,5,11],[5,12,5,15]]}
[]
[]
[]
[]
[null,null,null,null,null,"Initial Status"]
[null,null,null,null,null,"Ecosystem Services Sections","Indicators",null,"Type of Data",null,null,null,"Reliability"]
{"$rows_left_out":6}
{"sheet":"Metrics Present Status","index":14,"n_rows":11,"n_cols":16,"rows_kept":11,"cut":false,"hidden":false,"merged":[[4,5,4,15],[5,5,6,5],[5,6,5,7],[5,8,5,11],[5,12,5,15]]}
[]
[]
[]
[]
[null,null,null,null,null,"Present Status"]
[null,null,null,null,null,"Ecosystem Services Sections","Indicators",null,"Type of Data",null,null,null,"Reliability"]
{"$rows_left_out":5}